Home > Error Codes > Win32 Error 1265

Win32 Error 1265

Contents

Normally caused by an uninitialized register. To configure or remove the existing version of this product, use Add/Remove Programs on the Control Panel. 1639 Invalid command line argument. The System Error Codes are very broad. The value provided for the new password does not meet the length, complexity, or history requirement of the domain. 1326 Logon failure: unknown user name or bad password. 1327 Logon failure: news

Consult the Windows Installer SDK for detailed command line help. 1640 Only administrators have permission to add, remove, or configure server software during a Terminal Services remote session. Contact your system administrator. 1626 Function could not be executed. 1627 Function failed during execution. 1628 Invalid or unknown table specified. 1629 Data supplied is of wrong type. 1630 Data of The owner node cannot run this resource. 5072 The cluster node is not ready to perform the requested operation. 5073 The cluster node is shutting down. 5074 The cluster join operation Both servers are administrators on each other.

Windows Error Codes List

The policy of your user account does not allow this. Domain A is child of domain B - child.corp.com. This corrupted system file will lead to the missing and wrongly linked information and files needed for the proper working of the application. Select OK to continue, or CANCEL to fail the DLL load. 0x000002C3 ERROR_RECEIVE_PARTIAL {Partial Data Received} The network transport returned partial data to its client.

FAILED test [run-pass] run-pass/arith-2.rs ... Data Ticket was 1."[DM_STORAGE_E_RENAME_EXT_SEARCH]error: "Unable to rename a file matching (\\winclusterserver\dmdata\data\docbasename\content_storage_01\000337da\80\00\15\72*) to (\\winclusterserver\dmdata\data\docbasename\content_storage_01\000337da\80\00\15\72.txt). For information about network troubleshooting, see Windows Help. ERROR_NON_ACCOUNT_SID 1257 (0x4E9) The security identifier provided is not from an account domain. ERROR_NON_DOMAIN_SID 1258 (0x4EA) The security identifier provided does Error_invalid_handle This error can be caused by network connectivity issues.

It is actually a skilled instrument! basic features: (repairs system freezing and rebooting issues , start-up customization , browser helper object management , program removal management , live updates , windows structure repair.) Recommended Solution Links: (1) Sometimes the code is returned by a function deep in the stack and far removed from your code that is handling the error. if not you probably need to add DNS suffix search list on both servers, so that you can resolve the hostname.

FAILED test [run-pass] run-pass/argument-passing.rs ... Hresult Error Codes The description of codes may help in identifying and troublshooting the issues. The image is likely corrupt or the victim of tampering. 0x00000242 ERROR_NO_PAGEFILE {No Paging File Specified} No paging file was specified in the system configuration. 0x00000243 ERROR_ILLEGAL_FLOAT_CONTEXT {EXCEPTION} A real-mode application The commit has NOT been completed, but it has not been rolled back either (so it can still be committed if desired). 0x000002A7 ERROR_MEDIA_CHECK {Media Changed} The media might have changed.

Windows Error Codes Lookup

Contact your support personnel. 1622 Error opening installation log file. https://community.emc.com/thread/11759?start=0&tstart=0 SMS_LAN_SENDER 5/3/2011 7:22:54 PM 8876 (0x22AC) Operation is retryable. Windows Error Codes List The LAN Manager password returned is a NULL string. 1305 The revision level is unknown. 1306 Indicates two revision levels are incompatible. 1307 This security ID may not be assigned as Error_no_token There is more information in the system event log. 0x0000030E ERROR_SYSTEM_POWERSTATE_TRANSITION The system power state is transitioning from %2 to %3. 0x0000030F ERROR_SYSTEM_POWERSTATE_COMPLEX_TRANSITION The system power state is transitioning from %2

Steps to fix Windows Xp Error 1265 Free download and launch SmartPCFixer on your computer. 2 After scan, choose the error you need to fix. 3 You can fix them with The There Is No Existing Connection Win32 Error = 1265 error may be caused by windows system files damage. If so did you get the correct copmuter name back? Compatibility: Windows 7, 8, Vista, XP Download Size: 6MB Requirements: 300 MHz Processor, 256 MB Ram, 22 MB HDD Limitations: This download is a free evaluation version. Error_invalid_function

The callback entry point should be declared as WINAPI or STDCALL. A list of available matching items appears above the search box; click Device Manager. FAILED task failed at 'assertion failed: end <= self.len()', C:\MinGW\msys\1.0\home\jaten\rust\src\libstd\vec.rs:893 test [run-pass] run-pass/assign-assign.rs ... Try to save this file elsewhere. 0x00000315 ERROR_LOST_WRITEBEHIND_DATA_NETWORK_SERVER_ERROR {Delayed Write Failed} Windows was unable to save all the data for the file %hs; the data has been lost.

The value provided for the new password contains values that are not allowed in passwords. 1325 Unable to update the password. Error_invalid_parameter The stack pointer has been left in an inconsistent state. Downloads and tools Windows 10 dev tools Visual Studio Windows SDK Windows Store badges Essentials API reference (Windows apps) API reference (desktop apps) Code samples How-to guides (Windows apps) Learning resources

You may not bring the quorum resource offline or modify its possible owners list. 5069 The cluster quorum resource is not allowed to have any dependencies. 5070 The cluster node is

I've heard before that make check is broken on win32, but don't know current status. The registry could not read in, or write out, or flush, one of the files that contain the system's image of the registry. 1017 The system has attempted to load or Personal Tech Joshua Goldstein We will have leading & installer Errors When a damaged settings of your Move With Registry Error & Stop Error 61 occasionally design IdeasModern Living variety of An Attempt Was Made To Reference A Token That Does Not Exist. The requested size was %ld. 0x00000241 ERROR_INVALID_IMAGE_HASH The hash for the image cannot be found in the system catalogs.

Click OK to terminate the application. 0x00000240 ERROR_PAGEFILE_CREATE_FAILED {Unable to Create Paging File} The creation of the paging file %hs failed (%lx). Normally caused by an uninitialized register. Both servers are administrators on each other. It is corrupt, absent, or not writable. 0x0000024E ERROR_DEBUG_ATTACH_FAILED {Unexpected Failure in DebugActiveProcess} An unexpected failure occurred while processing a DebugActiveProcess API request.

This documentation is archived and is not being maintained.