Home > Visual Studio > Visual Studio Error C3254

Visual Studio Error C3254

Originally Posted by Salem You mean it's included as a crutch to help ancient programmers limp along without them having to relearn too much. Tricky. jimdavis08-04-2010, 06:54 PMWell, my end goal is to develope a Windows Form to do two things. Also, please learn to reduce your code to the smallest sample that results in the problem you need help with... check over here

Code: template class thread_safety = ptr_thread_dangerous, int Bits = 32> class mad_shared_ptr { //... } template bool operator == (const mad_shared_ptr& lhs, const mad_shared_ptr& rhs) { It's a member of the namespace that contains the class. Search User Find More Posts by Kave Find Threads by Kave Steam Users' Forums > Steam Tool Discussions > Source Coding Adding Weapon « Previous Thread | Next Thread » Compiler Error C3254 Visual Studio 2015 Other Versions Visual Studio 2013 Visual Studio 2012 Visual Studio 2010 Visual Studio 2008 Visual Studio 2005 Visual Studio .NET 2003  'explicit override' : class

Here is a sample of the compile errors: 1>------ Build started: Project: firstProj, Configuration: Debug Win32 ------ 1> userPlayer.cpp 1>c:\users\bn\dropbox\myprojects\mysoftware\c++\firstproj\firstproj\userplayer.h(9): error C2504: 'Player' : base class undefined 1>c:\program files (x86)\microsoft visual Register now! Personal Open source Business Explore Sign up Sign in Pricing Blog Support Search GitHub This repository Watch 705 Star 6,848 Fork 1,784 godotengine/godot Code Issues 1,418 Pull requests 73 Projects Then again it could be that I just needed to place the authenticate_win.h in the include folder.

Not both. When?" Your original source shadows the template parameter names(A nested template and the containing template both use the entity name `T'.) According to my first attempt at compiling the source you've Pick one; class or struct. Worse, you've already modified your source and may not solve the original problem.

Learning resources Microsoft Virtual Academy Channel 9 MSDN Magazine Community Forums Blogs Codeplex Support Self support Programs BizSpark (for startups) Microsoft Imagine (for students) United States (English) Newsletter Privacy & cookies Finally, look at the code you wrote: Code: template class Foo { template friend void bar(Foo& f) { f.wooble(); } void wooble(); }; Now you've defined a Put all the Heber code into a unique namespace (BTW I have Heber as namespace). Instantiate Foo, you also get bar(Foo&).

thanx very much! #include using namespace std; … Recommended Articles Random picture Last Post 41 Minutes Ago I am trying to generate a random image everytime someone clicks spin. That's why the compiler is complaining. Why are spare wheels smaller than normal wheels? when I compile, it gives me several warnings, and the ocassional errors.

  1. For instance, in the main function, objects that I had created and used weeks ago, suddenly got the red line under them and the syntax error "theClass is undefined".
  2. Not the answer you're looking for?
  3. I am not able to generate a random picture.
  4. Template friends for operators are tricky.
  5. I know the break out the operators and declare them as friends inside the class worked at some time but then it broke, but I don't know why or when or
  6. All these errors appeared at once.

Plus they're marked as inline which should make the compiler ignore multiple definitions, but I'm guessing that somewhere in all this is an exception or rule I don't know. see it here By ScrollMaster in forum Windows Programming Replies: 6 Last Post: 06-10-2006, 08:56 AM errors initializing D3D By Vacation Guy in forum C++ Programming Replies: 3 Last Post: 08-07-2005, 12:20 PM DLL jimdavis08-04-2010, 03:11 PMThis was very helpful, but it appears that the FadeDemo Project is a converted VS 2008 project. A firm farewell - Rest in piece Is there a technical term for this simple method of smoothing out a signal?

Isn't this what would be happen if the .h files disappeared? check my blog I think … Solving errors (LNK2028 and LNK2019) when trying to call unmanaged C++ from C++/CLI 2 replies I have some native C++ code that I want to use in C# Though one of them has "Error: expected a declaration" under the "Private:" heading for the private members. Yes No Additional feedback? 1500 characters remaining Submit Skip this Thank you!

I have two tables, I will call them first-half and second-half (of the year) Table: first id jan feb mar apr ----------------------- 2 80 90 70 60 3 50 40 60 o_O Where, when? The errors are: ...\texture.h(15) : error C3254: 'Texture' : class contains explicit override '{ctor}' but does not derive from an interface that contains the function declaration ...\texture.h(47) : see reference to http://pdctoday.com/visual-studio/visual-studio-error.php rfog08-05-2010, 01:52 PMI do not recommend use VS2003 to do any kind of projects.

As far as I can tell, my original solution fixes the compile error (at least in gcc it does). 04-13-2009 #9 Elysia View Profile View Forum Posts C++まいる!Cをこわせ! Join Date Oct I have been developing a program for about a month now in MS VisC++ 2010 express. jimdavis08-05-2010, 07:13 PMI decided to create a VS2008 C++/CLR.

template friend bool operator == (const mad_shared_ptr& lhs, const mad_shared_ptr& rhs) { return (lhs.m_ptr == rhs.m_ptr); } template friend bool operator != (const mad_shared_ptr& lhs,

vnen closed this Aug 31, 2016 vnen added the archived label Aug 31, 2016 Sign up for free to join this conversation on GitHub. jimdavis08-04-2010, 03:20 PMWell, I was actually able to get it compiled. One second to another all external header files and libraries suddenly disappeared in the eyes of the IDE. Note: C++ does not support default-int modules\visual_script\visual_script_nodes.cpp(2414): error C2143: syntax error: missing ';' before '++' modules\visual_script\visual_script_nodes.cpp(2414): error C2059: syntax error: ')' modules\visual_script\visual_script_nodes.cpp(2414): error C2334: unexpected token(s) preceding '{'; skipping apparent function

That's why the compiler is complaining. See ASP.NET Ajax CDN Terms of Use – http://www.asp.net/ajaxlibrary/CDN.ashx. ]]> current community chat Stack Overflow Meta Stack Overflow your I am trying to get all of our stuff brought up to date anyway. have a peek at these guys Also, I'm new to templates so if you have any tips you'd like to share I'd be grateful.

c++ This article has been dead for over six months. You may need to post the entire class (If it doesn't have a bunch of dependencies) if the problem persists. 04-13-2009 #5 Elysia View Profile View Forum Posts C++まいる!Cをこわせ! Join Date You just defined a class Foo, and a global function bar(Foo&) that is a friend of that class. The header files seem fine.

Nunix 1 post since Nov 2016 Newbie Member More Recommended Articles About Us Contact Us Donate Advertising Vendor Program Terms of Service Newsletter Archive Community Forums Recent Articles © 2002 - Thanks in advance. Reload to refresh your session. Note: C++ does not support default-int c:\documents and settings\server22\my documents\visual studio 2008\projects\x10testapp\x10testapp\fflyusb.h 251 Error 4 error C2143: syntax error : missing ';' before '*' c:\documents and settings\server22\my documents\visual studio 2008\projects\x10testapp\x10testapp\fflyusb.h 251

Originally Posted by Adak io.h certainly IS included in some modern compilers. I just thought it was standard procedure to include the namespace with its procedures. I am having some issues compiling though. Where?

cout is undefined right in the main class where it worked for weeks.