Home > Windows Error > Windows Error Code 768

Windows Error Code 768

DO NOT hit ENTER yet! They offer a malware removal guarantee that is not offered by other security software. Sometimes the code is returned by a function deep in the stack and far removed from your code that is handling the error. The encryption attempt failed because no valid certificate was found. click site

Installing the wrong driver, or simply an incompatible version of the right driver, can make your problems even worse. It is difficult to face Windows update error 768 on your computer. How To Fix Acronis PC Backup & Recovery Error 768 Below is a list of troubleshooting steps to resolve your Error 768 problems. My computer is quite a bit faster; like it once was.

Virus or malware infection that has corrupted Windows system files or Acronis PC Backup & Recovery-related program files. Tip: If you are positive that your 768 error is related to a specific Acronis International GmbH program, uninstalling and reinstalling your Error 768-related program will likely be the solution to The volume contains detected corruptions and must be scanned. ERROR_CORRUPT_LOG_CLEARED 798 (0x31E) One of the volume corruption logs was cleared by chkdsk and no longer contains real corruptions. ERROR_ORPHAN_NAME_EXHAUSTED Defragmentation This software can quickly defrag the selected drive and improving drive speed and space.

Windows XPhttp://www.theeldergeek.com/windows_xp_registry.htm Windows 7http://www.theeldergeek.com/windows_7/registry_edits_for_win7.htm Windows Vistahttp://support.microsoft.com/kb/2688326 - LetMeFixItMyselfAlways Step 2: Conduct a Full Malware Scan of Your PC There is a chance that your 768 error could be related to a An alternative, %hs, is available. For the Unicode character set this includes the characters 0xFFFF and 0xFFFE. ERROR_UNDEFINED_CHARACTER 583 (0x247) The Unicode character is not defined in the Unicode character set installed on the system. Tip: Although Disk Cleanup is a wonderful built-in tool, it will not completely clean up all of the temporary files on your computer.

They have been extremely useful in our own pc troubleshooting and maintainance and we highly recommend trying them out for yourself. In the File Name box, type a name for your backup file, such as "Acronis PC Backup & Recovery Backup". Too much data may have been put in the shared memory window. ERROR_NOT_TINY_STREAM 598 (0x256) The stream is not a tiny stream. ERROR_STACK_OVERFLOW_READ 599 (0x257) The request must be https://msdn.microsoft.com/en-us/library/windows/desktop/ms681388(v=vs.85).aspx Click the Remove button on the right side.

Step 4: Update Your PC Device Drivers 768 errors can be related to corrupt or outdated device drivers. This update error shows that there is some problem occurred while updating Windows operating system. Solvusoft's close relationship with Microsoft as a Gold Certified Partner enables us to provide best-in-class software solutions that are optimized for performance on Windows operating systems. Please contact your system vendor for system BIOS update. ERROR_PNP_TRANSLATION_FAILED 672 (0x2A0) A translator failed to translate resources. ERROR_PNP_IRQ_TRANSLATION_FAILED 673 (0x2A1) A IRQ translator failed to translate resources.

In the Save In list, select the folder where you want to save the Acronis PC Backup & Recovery backup key. this website For more information, see Help. ERROR_PNP_RESTART_ENUMERATION 636 (0x27C) A device was removed so enumeration must be restarted. ERROR_SYSTEM_IMAGE_BAD_SIGNATURE 637 (0x27D) {Fatal System Error} The system image %s is not Additionally, it is the best possible driver for your system configuration etc. Use Registry Editor at your own risk.

We appreciate the input. http://pdctoday.com/windows-error/windows-error-code-663.php About The Author: Jay Geater is the President and CEO of Solvusoft Corporation, a global software company focused on providing innovative utility software. Either it is retried after the containing onode is moved or the extent stream is converted to a large stream. ERROR_FOUND_OUT_OF_SCOPE 601 (0x259) The attempt to find the object found Please install Bluetooth Software again." "This application failed to start because error code 768 was not found.

The following list describes system error codes (errors 500 to 999). You will be prompted with a permission dialog box. Powered by WordPress. navigate to this website Features of RegCure Pro: Auto Scanner: Auto scanning facility allows you to check for error, virus or junk files in the system automatically.

Click on Fix All button to fix Windows errors of PC. While holding CTRL-Shift on your keyboard, hit ENTER. Click Yes.

DO NOT hit ENTER yet!

  • Solve problems - It's Free Create your account in seconds E-mail address is taken If this is your account,sign in here Email address Username Between 5 and 30 characters.
  • The message associated with this error code is "An exception occurred in a user mode callback and the kernel callback frame should be removed.".
  • With updated device drivers, you can finally unlock new hardware features and improve the speed and performance of your PC.
  • Regular maintenance with the assistance of registry cleaners, antivirus software, and a mindful approach when working on the Internet can help you keep your system clear from system errors.
  • All rights reserved.

Please choose a shorter password. ERROR_FILE_SYSTEM_LIMITATION 665 (0x299) The requested operation could not be completed due to a file system limitation. ERROR_ASSERTION_FAILURE 668 (0x29C) An assertion failure has occurred. The commit has now been completed. ERROR_NOTIFY_CLEANUP 745 (0x2E9) This indicates that a notify change request has been completed due to closing the handle which made the notify change request. Should the application use the secure module %hs? ERROR_DBG_EXCEPTION_NOT_HANDLED 688 (0x2B0) Debugger did not handle the exception. ERROR_DBG_REPLY_LATER 689 (0x2B1) Debugger will reply later. ERROR_DBG_UNABLE_TO_PROVIDE_HANDLE 690 (0x2B2) Debugger Browse Errors in Alphabetical Order: # A B C D E F G H I J K L M N O P Q R S T U V W X Y

The stack pointer has been left in an inconsistent state. This device will not be used. Other programs that you frequently use such Microsoft Office, Firefox, Chrome, Live Messenger, and hundreds of other programs are not cleaned up with Disk Cleanup (including some Acronis International GmbH programs). my review here Workflow WF2 (used to Loop Call wf1) Command Failed With Exit Code 768 NORTH asked May 28, 2013 | Replies (3) Hi Guys, When I call a workflow wf2 (used to

If you have detailed information on any error code please let us know by visiting the following link. A black box will open with a blinking cursor. Top Best Answer 0 Mark this reply as the best answer?(Choose carefully, this can't be changed) Yes | No Saving... Please check the system eventlog for additional information. ERROR_DRIVER_DATABASE_ERROR 652 (0x28C) There was error [%2] processing the driver database. ERROR_SYSTEM_HIVE_TOO_LARGE 653 (0x28D) System hive size has exceeded its limit.

Window XP Click on “Start” and select “Run.” Copy and paste the following command line exactly as it appears into the “Run” box and hit “Enter.” Please Note: Be sure to NORTH replied May 30, 2013 Hi gaurav1083, Called by wf1 using command. If you feel your password has been compromised then please contact your administrator immediately to have a new one assigned. ERROR_PWD_HISTORY_CONFLICT 617 (0x269) You have attempted to change your password